{"text_format":"1","workbook":"xlsx","n_sheets":7,"sheets":["和訳","英訳","和訳10問テスト_問題","英訳10問テスト_問題","10問テスト_答え","データ全部","Sheet1"],"not_rendered":{"charts":0,"images":1,"macros":1,"external_links":0,"defined_names":4,"comments":0,"pivot_tables":0},"unopened":[],"bounds":{"document_bytes":16777216,"sheet_cells":100000,"rows_first":2000,"rows_last":500,"rows_between":2000,"halvings":0,"cell_chars":16384,"cell_head_chars":4096},"cells_cut":0,"cells_raw":0,"read":"whole","date_system":"1900"}

{"sheet":"和訳","index":0,"n_rows":6,"n_cols":13,"rows_kept":6,"cut":false,"hidden":false,"merged":[[2,11,2,15],[3,1,3,15],[4,1,4,15],[5,1,5,15]]}
[null,"No.",{"$f":"ROUNDDOWN((H1-F1+1)*RAND(),0)+F1","v":138},null,null,1,"番から",600,"番まで"]
[null,null,null,null,null,null,null,null,null,null,"問題数",10,"題"]
[]
[null,{"$f":"VLOOKUP($C$1,テーブル2[],4,FALSE)","v":"音楽"}]
[]
[null,{"$f":"VLOOKUP($C$1,テーブル2[],3,FALSE)","v":"music"}]

{"sheet":"英訳","index":1,"n_rows":6,"n_cols":13,"rows_kept":6,"cut":false,"hidden":false,"merged":[[2,11,2,15],[3,1,3,15],[5,1,5,15],[4,1,4,15]]}
[null,"No.",{"$f":"ROUNDDOWN((H1-F1+1)*RAND(),0)+F1","v":344},null,null,1,"番から",600,"番まで"]
[null,null,null,null,null,null,null,null,null,null,"問題数",0,"題"]
[]
[null,{"$f":"VLOOKUP($C$1,テーブル2[],3,FALSE)","v":"dentist"}]
[]
[null,{"$f":"VLOOKUP($C$1,テーブル2[],4,FALSE)","v":"歯科医師"}]

{"sheet":"和訳10問テスト_問題","index":2,"n_rows":15,"n_cols":9,"rows_kept":15,"cut":false,"hidden":false,"merged":[[2,3,2,4]]}
[null,"確認 小テスト","小学校",null,null,1,"番から",600,"番まで"]
[null,null,"氏名：　　　　　　　"]
["No","日本語","英語","間違えたら覚えるべくここに練習すべし！"]
[1,{"$f":"英訳10問テスト_問題!B4","v":"P.E."},{"$f":"英訳10問テスト_問題!C4","v":"体育"}]
[2,{"$f":"英訳10問テスト_問題!B5","v":"down"},{"$f":"英訳10問テスト_問題!C5","v":"下へ"}]
[3,{"$f":"英訳10問テスト_問題!B6","v":"beautiful"},{"$f":"英訳10問テスト_問題!C6","v":"美しい"}]
[4,{"$f":"英訳10問テスト_問題!B7","v":"singer"},{"$f":"英訳10問テスト_問題!C7","v":"歌手"}]
[5,{"$f":"英訳10問テスト_問題!B8","v":"cold"},{"$f":"英訳10問テスト_問題!C8","v":"寒い、冷たい"}]
[6,{"$f":"英訳10問テスト_問題!B9","v":"ruler"},{"$f":"英訳10問テスト_問題!C9","v":"定規"}]
[7,{"$f":"英訳10問テスト_問題!B10","v":"Canada"},{"$f":"英訳10問テスト_問題!C10","v":"カナダ"}]
[8,{"$f":"英訳10問テスト_問題!B11","v":"gum"},{"$f":"英訳10問テスト_問題!C11","v":"ガム"}]
[9,{"$f":"英訳10問テスト_問題!B12","v":"cat"},{"$f":"英訳10問テスト_問題!C12","v":"猫"}]
[10,{"$f":"英訳10問テスト_問題!B13","v":"carrot"},{"$f":"英訳10問テスト_問題!C13","v":"にんじん"}]
[]
[null,null,"点"]

{"sheet":"英訳10問テスト_問題","index":3,"n_rows":15,"n_cols":9,"rows_kept":15,"cut":false,"hidden":false,"merged":[[2,3,2,4]]}
[null,"確認 小テスト","小学校",null,null,1,"番から",600,"番まで"]
[null,null,"氏名：　　　　　　　"]
["No","日本語","英語","間違えたら覚えるべくここに練習すべし！"]
[1,{"$f":"VLOOKUP(ROUNDDOWN(($H$1-$F$1+1)*RAND(),0)+$F$1,テーブル2[],3,FALSE)","v":"P.E."},{"$f":"VLOOKUP(B4,データ全部!$E:$F,2,FALSE)","v":"体育"}]
[2,{"$f":"VLOOKUP(ROUNDDOWN(($H$1-$F$1+1)*RAND(),0)+$F$1,テーブル2[],3,FALSE)","v":"down"},{"$f":"VLOOKUP(B5,データ全部!$E:$F,2,FALSE)","v":"下へ"}]
[3,{"$f":"VLOOKUP(ROUNDDOWN(($H$1-$F$1+1)*RAND(),0)+$F$1,テーブル2[],3,FALSE)","v":"beautiful"},{"$f":"VLOOKUP(B6,データ全部!$E:$F,2,FALSE)","v":"美しい"}]
[4,{"$f":"VLOOKUP(ROUNDDOWN(($H$1-$F$1+1)*RAND(),0)+$F$1,テーブル2[],3,FALSE)","v":"singer"},{"$f":"VLOOKUP(B7,データ全部!$E:$F,2,FALSE)","v":"歌手"}]
[5,{"$f":"VLOOKUP(ROUNDDOWN(($H$1-$F$1+1)*RAND(),0)+$F$1,テーブル2[],3,FALSE)","v":"cold"},{"$f":"VLOOKUP(B8,データ全部!$E:$F,2,FALSE)","v":"寒い、冷たい"}]
[6,{"$f":"VLOOKUP(ROUNDDOWN(($H$1-$F$1+1)*RAND(),0)+$F$1,テーブル2[],3,FALSE)","v":"ruler"},{"$f":"VLOOKUP(B9,データ全部!$E:$F,2,FALSE)","v":"定規"}]
[7,{"$f":"VLOOKUP(ROUNDDOWN(($H$1-$F$1+1)*RAND(),0)+$F$1,テーブル2[],3,FALSE)","v":"Canada"},{"$f":"VLOOKUP(B10,データ全部!$E:$F,2,FALSE)","v":"カナダ"}]
[8,{"$f":"VLOOKUP(ROUNDDOWN(($H$1-$F$1+1)*RAND(),0)+$F$1,テーブル2[],3,FALSE)","v":"gum"},{"$f":"VLOOKUP(B11,データ全部!$E:$F,2,FALSE)","v":"ガム"}]
[9,{"$f":"VLOOKUP(ROUNDDOWN(($H$1-$F$1+1)*RAND(),0)+$F$1,テーブル2[],3,FALSE)","v":"cat"},{"$f":"VLOOKUP(B12,データ全部!$E:$F,2,FALSE)","v":"猫"}]
[10,{"$f":"VLOOKUP(ROUNDDOWN(($H$1-$F$1+1)*RAND(),0)+$F$1,テーブル2[],3,FALSE)","v":"carrot"},{"$f":"VLOOKUP(B13,データ全部!$E:$F,2,FALSE)","v":"にんじん"}]
[]
[null,null,"点"]

{"sheet":"10問テスト_答え","index":4,"n_rows":15,"n_cols":9,"rows_kept":15,"cut":false,"hidden":false,"merged":[]}
[null,"確認 小テスト","小学生",null,null,1,"番から",600,"番まで"]
[null,null,"氏名：　　　　　　　"]
["No","日本語","英語"]
[1,{"$f":"英訳10問テスト_問題!B4","v":"P.E."},{"$f":"VLOOKUP(B4,データ全部!$E:$F,2,FALSE)","v":"体育"}]
[2,{"$f":"英訳10問テスト_問題!B5","v":"down"},{"$f":"VLOOKUP(B5,データ全部!$E:$F,2,FALSE)","v":"下へ"}]
[3,{"$f":"英訳10問テスト_問題!B6","v":"beautiful"},{"$f":"VLOOKUP(B6,データ全部!$E:$F,2,FALSE)","v":"美しい"}]
[4,{"$f":"英訳10問テスト_問題!B7","v":"singer"},{"$f":"VLOOKUP(B7,データ全部!$E:$F,2,FALSE)","v":"歌手"}]
[5,{"$f":"英訳10問テスト_問題!B8","v":"cold"},{"$f":"VLOOKUP(B8,データ全部!$E:$F,2,FALSE)","v":"寒い、冷たい"}]
[6,{"$f":"英訳10問テスト_問題!B9","v":"ruler"},{"$f":"VLOOKUP(B9,データ全部!$E:$F,2,FALSE)","v":"定規"}]
[7,{"$f":"英訳10問テスト_問題!B10","v":"Canada"},{"$f":"VLOOKUP(B10,データ全部!$E:$F,2,FALSE)","v":"カナダ"}]
[8,{"$f":"英訳10問テスト_問題!B11","v":"gum"},{"$f":"VLOOKUP(B11,データ全部!$E:$F,2,FALSE)","v":"ガム"}]
[9,{"$f":"英訳10問テスト_問題!B12","v":"cat"},{"$f":"VLOOKUP(B12,データ全部!$E:$F,2,FALSE)","v":"猫"}]
[10,{"$f":"英訳10問テスト_問題!B13","v":"carrot"},{"$f":"VLOOKUP(B13,データ全部!$E:$F,2,FALSE)","v":"にんじん"}]
[]
[null,null,"点"]

{"sheet":"データ全部","index":5,"n_rows":601,"n_cols":6,"rows_kept":601,"cut":false,"hidden":false,"merged":[]}
[null,null,"No","カテゴリー","日本語","英語"]
["小学校",null,1,"名詞","number","数"]
["小学校",null,2,"名詞","zero",0]
["小学校",null,3,"名詞","one",1]
["小学校",null,4,"名詞","two",2]
["小学校",null,5,"名詞","three",3]
["小学校",null,6,"名詞","four",4]
["小学校",null,7,"名詞","five",5]
["小学校",null,8,"名詞","six",6]
["小学校",null,9,"名詞","seven",7]
["小学校",null,10,"名詞","eight",8]
["小学校",null,11,"名詞","nine",9]
["小学校",null,12,"名詞","ten",10]
["小学校",null,13,"名詞","eleven",11]
["小学校",null,14,"名詞","twelve",12]
["小学校",null,15,"名詞","thirteen",13]
["小学校",null,16,"名詞","fourteen",14]
["小学校",null,17,"名詞","fifteen",15]
["小学校",null,18,"名詞","sixteen",16]
["小学校",null,19,"名詞","seventeen",17]
["小学校",null,20,"名詞","eighteen",18]
["小学校",null,21,"名詞","nineteen",19]
["小学校",null,22,"名詞","twenty",20]
["小学校",null,23,"名詞","thirty",30]
["小学校",null,24,"名詞","forty",40]
["小学校",null,25,"名詞","fifty",50]
["小学校",null,26,"名詞","sixty",60]
["小学校",null,27,"名詞","seventy",70]
["小学校",null,28,"名詞","eighty",80]
["小学校",null,29,"名詞","ninety",90]
["小学校",null,30,"名詞","hundred",100]
["小学校",null,31,"名詞","first","1番目の"]
["小学校",null,32,"名詞","second","2番目の"]
["小学校",null,33,"名詞","third","3番目の"]
["小学校",null,34,"名詞","fourth","4番目の"]
["小学校",null,35,"名詞","fifth","5番目の"]
["小学校",null,36,"名詞","sixth","6番目の"]
["小学校",null,37,"名詞","seventh","7番目の"]
["小学校",null,38,"名詞","eighth","8番目の"]
["小学校",null,39,"名詞","ninth","9番目の"]
["小学校",null,40,"名詞","tenth","10番目の"]
["小学校",null,41,"名詞","eleventh","11番目の"]
["小学校",null,42,"名詞","twelfth","12番目の"]
["小学校",null,43,"名詞","thirteenth","13番目の"]
["小学校",null,44,"名詞","fourteenth","14番目の"]
["小学校",null,45,"名詞","fifteenth","15番目の"]
["小学校",null,46,"名詞","sixteenth","16番目の"]
["小学校",null,47,"名詞","seventeenth","17番目の"]
["小学校",null,48,"名詞","eighteenth","18番目の"]
["小学校",null,49,"名詞","nineteenth","19番目の"]
["小学校",null,50,"名詞","twentieth","20番目の"]
["小学校",null,51,"名詞","thirtieth","30番目の"]
["小学校",null,52,"名詞","minute","分"]
["小学校",null,53,"名詞","time","時間"]
["小学校",null,54,"名詞","day","日"]
["小学校",null,55,"名詞","week","週"]
["小学校",null,56,"名詞","month","月"]
["小学校",null,57,"名詞","year","年"]
["小学校",null,58,"名詞","Monday","月曜日"]
["小学校",null,59,"名詞","Tuesday","火曜日"]
["小学校",null,60,"名詞","Wednesday","水曜日"]
["小学校",null,61,"名詞","Thursday","木曜日"]
["小学校",null,62,"名詞","Friday","金曜日"]
["小学校",null,63,"名詞","Saturday","土曜日"]
["小学校",null,64,"名詞","Sunday","日曜日"]
["小学校",null,65,"名詞","January","1月"]
["小学校",null,66,"名詞","February","2月"]
["小学校",null,67,"名詞","March","3月"]
["小学校",null,68,"名詞","April","4月"]
["小学校",null,69,"名詞","May","5月"]
["小学校",null,70,"名詞","June","6月"]
["小学校",null,71,"名詞","July","7月"]
["小学校",null,72,"名詞","August","8月"]
["小学校",null,73,"名詞","September","9月"]
["小学校",null,74,"名詞","October","10月"]
["小学校",null,75,"名詞","November","11月"]
["小学校",null,76,"名詞","December","12月"]
["小学校",null,77,"名詞","spring","春"]
["小学校",null,78,"名詞","summer","夏"]
["小学校",null,79,"名詞","autumn/fall","秋"]
["小学校",null,80,"名詞","winter","冬"]
["小学校",null,81,"名詞","east","東"]
["小学校",null,82,"名詞","west","西"]
["小学校",null,83,"名詞","south","南"]
["小学校",null,84,"名詞","north","北"]
["小学校",null,85,"名詞","color","色"]
["小学校",null,86,"名詞","white","白、白い"]
["小学校",null,87,"名詞","black","黒、黒い"]
["小学校",null,88,"名詞","red","赤、赤い"]
["小学校",null,89,"名詞","blue","青、青い"]
["小学校",null,90,"名詞","yellow","黄色、黄色の"]
["小学校",null,91,"名詞","green","緑色、緑色の"]
["小学校",null,92,"名詞","orange","オレンジ色の"]
["小学校",null,93,"名詞","pink","ピンク色、ピンク色の"]
["小学校",null,94,"名詞","brown","茶色、茶色の"]
["小学校",null,95,"名詞","purple","紫色、紫色の"]
["小学校",null,96,"名詞","shape","形"]
["小学校",null,97,"名詞","circle","円"]
["小学校",null,98,"名詞","triangle","三角形"]
["小学校",null,99,"名詞","square","正方形"]
["小学校",null,100,"名詞","diamond","ひし形"]
["小学校",null,101,"名詞","heart","ハート形"]
["小学校",null,102,"名詞","star","星形、星"]
["小学校",null,103,"名詞","cross","十字形"]
["小学校",null,104,"名詞","man","人、男の人"]
["小学校",null,105,"名詞","woman","女の人"]
["小学校",null,106,"名詞","boy","男の子"]
["小学校",null,107,"名詞","girl","女の子"]
["小学校",null,108,"名詞","father","父"]
["小学校",null,109,"名詞","mother","母"]
["小学校",null,110,"名詞","brother","兄、弟"]
["小学校",null,111,"名詞","sister","姉、妹"]
["小学校",null,112,"名詞","grandfather","祖父"]
["小学校",null,113,"名詞","grandmother","祖母"]
["小学校",null,114,"名詞","friend","友達"]
["小学校",null,115,"名詞","eye","目"]
["小学校",null,116,"名詞","ear","耳"]
["小学校",null,117,"名詞","nose","鼻"]
["小学校",null,118,"名詞","mouth","口"]
["小学校",null,119,"名詞","teeth","歯（※ tooth の複数形）"]
["小学校",null,120,"名詞","face","顔"]
["小学校",null,121,"名詞","head","頭"]
["小学校",null,122,"名詞","hand","手（手首から先）"]
["小学校",null,123,"名詞","shoulder","肩"]
["小学校",null,124,"名詞","knee","ひざ"]
["小学校",null,125,"名詞","leg","あし（足首から上）"]
["小学校",null,126,"名詞","toe","つま先"]
["小学校",null,127,"名詞","school","学校"]
["小学校",null,128,"名詞","elementary school","小学校"]
["小学校",null,129,"名詞","junior high school","中学校"]
["小学校",null,130,"名詞","(senior) high shool","高等学校"]
["小学校",null,131,"名詞","class","授業、組"]
["小学校",null,132,"名詞","arts and crafts","図画工作"]
["小学校",null,133,"名詞","calligraphy","習字"]
["小学校",null,134,"名詞","English","英語"]
["小学校",null,135,"名詞","home economics","家庭科"]
["小学校",null,136,"名詞","Japanese","国語、日本語"]
["小学校",null,137,"名詞","math","算数"]
["小学校",null,138,"名詞","music","音楽"]
["小学校",null,139,"名詞","moral education","道徳"]
["小学校",null,140,"名詞","P.E.","体育"]
["小学校",null,141,"名詞","science","理科、化学"]
["小学校",null,142,"名詞","social studies /td>","社会科"]
["小学校",null,143,"名詞","homeroom activities","学級活動"]
["小学校",null,144,"名詞","classroom","教室"]
["小学校",null,145,"名詞","computer room","コンピュータールーム"]
["小学校",null,146,"名詞","cooking room","家庭科室"]
["小学校",null,147,"名詞","entrance","昇降口、入り口"]
["小学校",null,148,"名詞","gym","体育館"]
["小学校",null,149,"名詞","library","図書室、図書館"]
["小学校",null,150,"名詞","playground","校庭"]
["小学校",null,151,"名詞","restroom","トイレ"]
["小学校",null,152,"名詞","school principal’s office","校長室"]
["小学校",null,153,"名詞","school nurse’s office","保健室"]
["小学校",null,154,"名詞","crayon","クレヨン"]
["小学校",null,155,"名詞","eraser","消しゴム"]
["小学校",null,156,"名詞","glue stick","スティックのり"]
["小学校",null,157,"名詞","ink","インク"]
["小学校",null,158,"名詞","magnet","じしゃく"]
["小学校",null,159,"名詞","marker","マーカー"]
["小学校",null,160,"名詞","notebook","ノート"]
["小学校",null,161,"名詞","pen","ペン"]
["小学校",null,162,"名詞","pencil","鉛筆"]
["小学校",null,163,"名詞","pencil case","筆箱"]
["小学校",null,164,"名詞","pencil sharpener","鉛筆削り"]
["小学校",null,165,"名詞","ruler","定規"]
["小学校",null,166,"名詞","scissors","はさみ"]
["小学校",null,167,"名詞","stapler","ホッチキス"]
["小学校",null,168,"名詞","entrance ceremony","入学式"]
["小学校",null,169,"名詞","field trip","遠足"]
["小学校",null,170,"名詞","graduation ceremony","卒業式"]
["小学校",null,171,"名詞","school trip","修学旅行"]
["小学校",null,172,"名詞","sports festival","運動会"]
["小学校",null,173,"名詞","swimming meet","水泳大会"]
["小学校",null,174,"名詞","sport","スポーツ"]
["小学校",null,175,"名詞","soccer","サッカー"]
["小学校",null,176,"名詞","baseball","野球"]
["小学校",null,177,"名詞","basketball","バスケットボール"]
["小学校",null,178,"名詞","volleyball","バレーボール"]
["小学校",null,179,"名詞","dodgeball","ドッジボール"]
["小学校",null,180,"名詞","wimming","水泳"]
["小学校",null,181,"名詞","table tennis","卓球"]
["小学校",null,182,"名詞","badminton","バドミントン"]
["小学校",null,183,"名詞","tennis","テニス"]
["小学校",null,184,"名詞","marathon","マラソン"]
["小学校",null,185,"名詞","gymnastics","体操"]
["小学校",null,186,"名詞","track and field","陸上競技"]
["小学校",null,187,"名詞","cycling","サイクリング"]
["小学校",null,188,"名詞","rugby","ラグビー"]
["小学校",null,189,"名詞","boxing","ボクシング"]
["小学校",null,190,"名詞","climbing","登山"]
["小学校",null,191,"名詞","bat","バット"]
["小学校",null,192,"名詞","ball","ボール"]
["小学校",null,193,"名詞","racket","ラケット"]
["小学校",null,194,"名詞","athletics","運動競技"]
["小学校",null,195,"名詞","camping","キャンプ"]
["小学校",null,196,"名詞","fishing","魚釣り"]
["小学校",null,197,"名詞","hiking","ハイキング"]
["小学校",null,198,"名詞","jogging","ジョギング"]
["小学校",null,199,"名詞","jump rope","なわとび"]
["小学校",null,200,"名詞","yo-yo","ヨーヨー"]
["小学校",null,201,"名詞","tag","おにごっこ"]
["小学校",null,202,"名詞","shopping","買い物"]
["小学校",null,203,"名詞","piano","ピアノ"]
["小学校",null,204,"名詞","guitar","ギター"]
["小学校",null,205,"名詞","violin","バイオリン"]
["小学校",null,206,"名詞","drum","ドラム"]
["小学校",null,207,"名詞","recorder","リコーダー"]
["小学校",null,208,"名詞","vacation","休暇"]
["小学校",null,209,"名詞","animal","動物"]
["小学校",null,210,"名詞","cat","猫"]
["小学校",null,211,"名詞","dog","犬"]
["小学校",null,212,"名詞","fish","魚"]
["小学校",null,213,"名詞","bear","クマ"]
["小学校",null,214,"名詞","elephant","象"]
["小学校",null,215,"名詞","panda","パンダ"]
["小学校",null,216,"名詞","lion","ライオン"]
["小学校",null,217,"名詞","pig","ぶた"]
["小学校",null,218,"名詞","monkey","さる"]
["小学校",null,219,"名詞","mouse","ねずみ"]
["小学校",null,220,"名詞","horse","馬"]
["小学校",null,221,"名詞","chicken","にわとり"]
["小学校",null,222,"名詞","gorilla","ゴリラ"]
["小学校",null,223,"名詞","sheep","ひつじ"]
["小学校",null,224,"名詞","tiger","とら"]
["小学校",null,225,"名詞","rabbit","うさぎ"]
["小学校",null,226,"名詞","koala","コアラ"]
["小学校",null,227,"名詞","duck","あひる"]
["小学校",null,228,"名詞","fox","きつね"]
["小学校",null,229,"名詞","frog","かえる"]
["小学校",null,230,"名詞","snake","へび"]
["小学校",null,231,"名詞","wolf","おおかみ"]
["小学校",null,232,"名詞","goat","ヤギ"]
["小学校",null,233,"名詞","ant","あり"]
["小学校",null,234,"名詞","cow","（メスの）牛"]
["小学校",null,235,"名詞","ox","（雄の）牛"]
["小学校",null,236,"名詞","spider","くも"]
["小学校",null,237,"名詞","jaguar","ジャガー、ヒョウ"]
["小学校",null,238,"名詞","zebra","しまうま"]
["小学校",null,239,"名詞","seal","アザラシ、アシカ、オットセイ"]
["小学校",null,240,"名詞","food","食べ物"]
["小学校",null,241,"名詞","fruit","果物"]
["小学校",null,242,"名詞","apple","りんご"]
["小学校",null,243,"名詞","banana","バナナ"]
["小学校",null,244,"名詞","peach","もも"]
["小学校",null,245,"名詞","strawberry","いちご"]
["小学校",null,246,"名詞","grape","ぶどう"]
["小学校",null,247,"名詞","orange","オレンジ"]
["小学校",null,248,"名詞","melon","メロン"]
["小学校",null,249,"名詞","pineapple","パイナップル"]
["小学校",null,250,"名詞","cherry","さくらんぼ"]
["小学校",null,251,"名詞","lemon","レモン"]
["小学校",null,252,"名詞","kiwi fruit","キウイフルーツ"]
["小学校",null,253,"名詞","watermelon","すいか"]
["小学校",null,254,"名詞","vegetable","野菜"]
["小学校",null,255,"名詞","tomato","トマト"]
["小学校",null,256,"名詞","carrot","にんじん"]
["小学校",null,257,"名詞","onion","たまねぎ"]
["小学校",null,258,"名詞","potato","じゃがいも"]
["小学校",null,259,"名詞","green pepper","ピーマン"]
["小学校",null,260,"名詞","cucumber","きゅうり"]
["小学校",null,261,"名詞","lettuce","レタス"]
["小学校",null,262,"名詞","cabbage","キャベツ"]
["小学校",null,263,"名詞","corn","とうもろこし"]
["小学校",null,264,"名詞","mushroom","きのこ"]
["小学校",null,265,"名詞","nut","木の実、ナッツ"]
["小学校",null,266,"名詞","breakfast","朝食"]
["小学校",null,267,"名詞","lunch","昼食"]
["小学校",null,268,"名詞","dinner","夕食"]
["小学校",null,269,"名詞","rice","米、ごはん"]
["小学校",null,270,"名詞","rice ball","おにぎり"]
["小学校",null,271,"名詞","miso","みそ"]
["小学校",null,272,"名詞","miso soup","味噌汁"]
["小学校",null,273,"名詞","noodle","めん"]
["小学校",null,274,"名詞","bread","パン"]
["小学校",null,275,"名詞","jam","ジャム"]
["小学校",null,276,"名詞","egg","卵"]
["小学校",null,277,"名詞","fish","魚"]
["小学校",null,278,"名詞","curry and rice","カレーライス"]
["小学校",null,279,"名詞","ramen","ラーメン"]
["小学校",null,280,"名詞","sandwich","サンドイッチ"]
["小学校",null,281,"名詞","spaghetti","スパゲッティ"]
["小学校",null,282,"名詞","pizza","ピザ"]
["小学校",null,283,"名詞","hamburger","ハンバーガー"]
["小学校",null,284,"名詞","hot dog","ホットドッグ"]
["小学校",null,285,"名詞","salad","サラダ"]
["小学校",null,286,"名詞","pie","パイ"]
["小学校",null,287,"名詞","fried chicken","フライドチキン"]
["小学校",null,288,"名詞","french fries","フライドポテト"]
["小学校",null,289,"名詞","soup","スープ"]
["小学校",null,290,"名詞","corn soup","コーンスープ"]
["小学校",null,291,"名詞","sausage","ソーセージ"]
["小学校",null,292,"名詞","beefsteak","ビーフステーキ"]
["小学校",null,293,"名詞","omelet","オムレツ"]
["小学校",null,294,"名詞","grilled fish","焼き魚"]
["小学校",null,295,"名詞","namul","ナムル"]
["小学校",null,296,"名詞","dessert","デザート"]
["小学校",null,297,"名詞","ice cream","アイスクリーム"]
["小学校",null,298,"名詞","cake","ケーキ"]
["小学校",null,299,"名詞","cup cake","カップケーキ"]
["小学校",null,300,"名詞","chocolate","チョコレート"]
["小学校",null,301,"名詞","donut","ドーナツ"]
["小学校",null,302,"名詞","popcorn","ポップコーン"]
["小学校",null,303,"名詞","daifuku","大福"]
["小学校",null,304,"名詞","pudding","プリン"]
["小学校",null,305,"名詞","parfait","パフェ"]
["小学校",null,306,"名詞","shaved ice","かき氷"]
["小学校",null,307,"名詞","gum","ガム"]
["小学校",null,308,"名詞","snack","軽食、おやつ"]
["小学校",null,309,"名詞","water","水"]
["小学校",null,310,"名詞","milk","牛乳"]
["小学校",null,311,"名詞","juice","〔果汁100％の〕ジュース"]
["小学校",null,312,"名詞","coffee","コーヒー"]
["小学校",null,313,"名詞","tea","紅茶"]
["小学校",null,314,"名詞","green tea","日本茶、緑茶"]
["小学校",null,315,"名詞","mineral water","ミネラルウォーター"]
["小学校",null,316,"名詞","soda pop","炭酸飲料"]
["小学校",null,317,"名詞","country","国"]
["小学校",null,318,"名詞","Argentina","アルゼンチン"]
["小学校",null,319,"名詞","Brazil","ブラジル"]
["小学校",null,320,"名詞","Britain","イギリス"]
["小学校",null,321,"名詞","Canada","カナダ"]
["小学校",null,322,"名詞","China","中国"]
["小学校",null,323,"名詞","Denmark","デンマーク"]
["小学校",null,324,"名詞","Egypt","エジプト"]
["小学校",null,325,"名詞","Finland","フィンランド"]
["小学校",null,326,"名詞","France","フランス"]
["小学校",null,327,"名詞","India","インド"]
["小学校",null,328,"名詞","Italy","イタリア"]
["小学校",null,329,"名詞","Japan","日本"]
["小学校",null,330,"名詞","Peru","ペルー"]
["小学校",null,331,"名詞","Russia","ロシア"]
["小学校",null,332,"名詞","Singapore","シンガポール"]
["小学校",null,333,"名詞","Spain","スペイン"]
["小学校",null,334,"名詞","Turkey","トルコ"]
["小学校",null,335,"名詞","Thailand","タイ"]
["小学校",null,336,"名詞","United States of America／America","アメリカ合衆国"]
["小学校",null,337,"名詞","Mexico","メキシコ"]
["小学校",null,338,"名詞","world","世界"]
["小学校",null,339,"名詞","job","仕事"]
["小学校",null,340,"名詞","teacher","教師"]
["小学校",null,341,"名詞","doctor","医者"]
["小学校",null,342,"名詞","police officer","警察官"]
["小学校",null,343,"名詞","fire fighter","消防士"]
["小学校",null,344,"名詞","dentist","歯科医師"]
["小学校",null,345,"名詞","pilot","パイロット"]
["小学校",null,346,"名詞","flight attendant","客室乗務員"]
["小学校",null,347,"名詞","bus driver","バスの運転手"]
["小学校",null,348,"名詞","baker","パン屋の店主"]
["小学校",null,349,"名詞","florist","生花店の店主"]
["小学校",null,350,"名詞","cook","料理人、コック"]
["小学校",null,351,"名詞","farmer","農場経営者"]
["小学校",null,352,"名詞","artist","芸術家"]
["小学校",null,353,"名詞","astronaut","宇宙飛行士"]
["小学校",null,354,"名詞","vet","獣医師"]
["小学校",null,355,"名詞","zookeeper","動物園の飼育員"]
["小学校",null,356,"名詞","soccer player","サッカー選手"]
["小学校",null,357,"名詞","baseball player","野球選手"]
["小学校",null,358,"名詞","figure skater","フィギュアスケート選手"]
["小学校",null,359,"名詞","singer","歌手"]
["小学校",null,360,"名詞","comedian","コメディアン"]
["小学校",null,361,"名詞","hero","英雄"]
["小学校",null,362,"名詞","king","王様"]
["小学校",null,363,"名詞","queen","女王"]
["小学校",null,364,"名詞","house ","家"]
["小学校",null,365,"名詞","hospital ","病院"]
["小学校",null,366,"名詞","police station ","警察署"]
["小学校",null,367,"名詞","fire station ","消防署"]
["小学校",null,368,"名詞","post office ","郵便局"]
["小学校",null,369,"名詞","post","ポスト"]
["小学校",null,370,"名詞","station","駅"]
["小学校",null,371,"名詞","park","公園"]
["小学校",null,372,"名詞","street","通り、道"]
["小学校",null,373,"名詞","library","図書館、図書室"]
["小学校",null,374,"名詞","museum","博物館、美術館"]
["小学校",null,375,"名詞","zoo","動物園"]
["小学校",null,376,"名詞","aquarium","水族館"]
["小学校",null,377,"名詞","amusement park","遊園地"]
["小学校",null,378,"名詞","convenience store","コンビニ"]
["小学校",null,379,"名詞","supermarket","スーパーマーケット"]
["小学校",null,380,"名詞","department store","デパート"]
["小学校",null,381,"名詞","restaurant ","レストラン"]
["小学校",null,382,"名詞","bookstore ","書店"]
["小学校",null,383,"名詞","flower shop","生花店"]
["小学校",null,384,"名詞","gas station ","ガソリンスタンド"]
["小学校",null,385,"名詞","shrine","神社"]
["小学校",null,386,"名詞","temple","寺"]
["小学校",null,387,"名詞","castle","城"]
["小学校",null,388,"名詞","sun ","太陽"]
["小学校",null,389,"名詞","river","川"]
["小学校",null,390,"名詞","sea ","海"]
["小学校",null,391,"名詞","beach ","浜辺"]
["小学校",null,392,"名詞","lake ","湖"]
["小学校",null,393,"名詞","mountain ","山"]
["小学校",null,394,"名詞","tree ","木"]
["小学校",null,395,"名詞","flower ","花"]
["小学校",null,396,"名詞","rainbow ","にじ"]
["小学校",null,397,"名詞","birthday","誕生日"]
["小学校",null,398,"名詞","New Year’s Day","元日"]
["小学校",null,399,"名詞","New Year’s Eve","大みそか"]
["小学校",null,400,"名詞","festival","祭り"]
["小学校",null,401,"名詞","Star Festival","七夕"]
["小学校",null,402,"名詞","Children’s Day ","子供の日"]
["小学校",null,403,"名詞","Doll’s Festival","ひな祭り"]
["小学校",null,404,"名詞","bus ","バス"]
["小学校",null,405,"名詞","jet","ジェット機"]
["小学校",null,406,"名詞","taxi","タクシー"]
["小学校",null,407,"名詞","bicycle","自転車"]
["小学校",null,408,"名詞","unicycle","一輪車"]
["小学校",null,409,"名詞","wheelchair","車椅子"]
["小学校",null,410,"名詞","desk","机"]
["小学校",null,411,"名詞","table","テーブル"]
["小学校",null,412,"名詞","chair","椅子"]
["小学校",null,413,"名詞","bed ","ベッド"]
["小学校",null,414,"名詞","TV","テレビ"]
["小学校",null,415,"名詞","bath","風呂"]
["小学校",null,416,"名詞","cap","（ふちのない）帽子"]
["小学校",null,417,"名詞","hat","（ふちのある）帽子"]
["小学校",null,418,"名詞","gloves","手袋"]
["小学校",null,419,"名詞","shirt","シャツ"]
["小学校",null,420,"名詞","T-shirt","Ｔシャツ"]
["小学校",null,421,"名詞","sweater","セーター"]
["小学校",null,422,"名詞","vest","ベスト"]
["小学校",null,423,"名詞","pants","ズボン"]
["小学校",null,424,"名詞","shorts","半ズボン"]
["小学校",null,425,"名詞","boots","ブーツ"]
["小学校",null,426,"名詞","box","箱"]
["小学校",null,427,"名詞","book","本"]
["小学校",null,428,"名詞","bag","かばん"]
["小学校",null,429,"名詞","umbrella","かさ"]
["小学校",null,430,"名詞","clock","時計"]
["小学校",null,431,"名詞","watch","腕時計"]
["小学校",null,432,"名詞","telephone","電話"]
["小学校",null,433,"名詞","computer","コンピューター"]
["小学校",null,434,"名詞","cup","茶わん、カップ"]
["小学校",null,435,"名詞","dish","皿"]
["小学校",null,436,"名詞","lunch box","お弁当箱"]
["小学校",null,437,"名詞","calendar","カレンダー"]
["小学校",null,438,"名詞","fan","うちわ"]
["小学校",null,439,"名詞","newspaper ","新聞"]
["小学校",null,440,"名詞","garbage","ゴミ"]
["小学校",null,441,"名詞","card","カード"]
["小学校",null,442,"名詞","fireworks","花火"]
["小学校",null,443,"名詞","net","ネット"]
["小学校",null,444,"名詞","treasure","宝物"]
["小学校",null,445,"名詞","homework","宿題"]
["小学校",null,446,"名詞","TV program","テレビ番組"]
["小学校",null,447,"名詞","morning","朝、午前"]
["小学校",null,448,"名詞","afternoon","午後"]
["小学校",null,449,"名詞","night","夜"]
["小学校",null,450,"名詞","today","今日"]
["小学校",null,451,"名詞","tomorrow","明日"]
["小学校",null,452,"動詞","is","～です（三人称単数）"]
["小学校",null,453,"動詞","am","～です（一人称単数）"]
["小学校",null,454,"動詞","are","～です（二人称単数、複数）"]
["小学校",null,455,"動詞","do","～する（三人称単数以外）"]
["小学校",null,456,"動詞","does","～する（三人称単数）"]
["小学校",null,457,"動詞","speak","話す"]
["小学校",null,458,"動詞","read","読む"]
["小学校",null,459,"動詞","study","勉強する"]
["小学校",null,460,"動詞","like","好きだ"]
["小学校",null,461,"動詞","want","ほしい"]
["小学校",null,462,"動詞","look","見る"]
["小学校",null,463,"動詞","walk","歩く・散歩させる"]
["小学校",null,464,"動詞","run","走る"]
["小学校",null,465,"動詞","eat","食べる"]
["小学校",null,466,"動詞","drink","飲む"]
["小学校",null,467,"動詞","sing","歌う"]
["小学校",null,468,"動詞","jump","ジャンプする"]
["小学校",null,469,"動詞","dance","おどる"]
["小学校",null,470,"動詞","stop","止まる"]
["小学校",null,471,"動詞","buy","買う"]
["小学校",null,472,"動詞","see","見える、（人に）会う"]
["小学校",null,473,"動詞","cook","料理する"]
["小学校",null,474,"動詞","watch","（じっと）見る"]
["小学校",null,475,"動詞","teach","教える"]
["小学校",null,476,"動詞","meet","会う"]
["小学校",null,477,"動詞","play","（スポーツを）する、演奏する"]
["小学校",null,478,"動詞","get","手に入れる"]
["小学校",null,479,"動詞","make","作る"]
["小学校",null,480,"動詞","put","置く"]
["小学校",null,481,"動詞","sound","～に聞こえる"]
["小学校",null,482,"動詞","clean","そうじする"]
["小学校",null,483,"動詞","wash","洗う"]
["小学校",null,484,"動詞","leave","去る、出発する"]
["小学校",null,485,"動詞","ride","乗る"]
["小学校",null,486,"動詞","turn","曲がる"]
["小学校",null,487,"動詞","check","確認する"]
["小学校",null,488,"動詞","brush","みがく"]
["小学校",null,489,"動詞","practice","練習する"]
["小学校",null,490,"動詞","swim","泳ぐ"]
["小学校",null,491,"動詞","ski","スキーをする"]
["小学校",null,492,"動詞","skate","スケートをする"]
["小学校",null,493,"形容詞","good","よい、上手な"]
["小学校",null,494,"形容詞","fine","けっこうな、元気な"]
["小学校",null,495,"形容詞","nice","すてきな"]
["小学校",null,496,"形容詞","great","すばらしい（g~）"]
["小学校",null,497,"形容詞","wonderful","すばらしい（w~）"]
["小学校",null,498,"形容詞","fantastic","すばらしい（f~）"]
["小学校",null,499,"形容詞","big","大きい"]
["小学校",null,500,"形容詞","small","小さい"]
["小学校",null,501,"形容詞","long","長い"]
["小学校",null,502,"形容詞","short","短い"]
["小学校",null,503,"形容詞","high","高い、高く"]
["小学校",null,504,"形容詞","hard","難しい、一生懸命に"]
["小学校",null,505,"形容詞","soft","やわらかい"]
["小学校",null,506,"形容詞","new","新しい"]
["小学校",null,507,"形容詞","old","古い"]
["小学校",null,508,"形容詞","many","たくさんの(数えられる)"]
["小学校",null,509,"形容詞","much","たくさんの(数えられない)"]
["小学校",null,510,"形容詞","special","特別な"]
["小学校",null,511,"形容詞","beautiful","美しい"]
["小学校",null,512,"形容詞","exciting","わくわくさせる"]
["小学校",null,513,"形容詞","fun","たのしい、おもしろい"]
["小学校",null,514,"形容詞","hot","暑い、熱い、からい"]
["小学校",null,515,"形容詞","cold","寒い、冷たい"]
["小学校",null,516,"形容詞","cool","すずしい"]
["小学校",null,517,"形容詞","happy","幸せな"]
["小学校",null,518,"形容詞","sorry","すまないと思って"]
["小学校",null,519,"形容詞","sad","悲しい"]
["小学校",null,520,"形容詞","sleepy","ねむい"]
["小学校",null,521,"形容詞","tired","つかれた"]
["小学校",null,522,"形容詞","hungry","空腹の"]
["小学校",null,523,"形容詞","busy","いそがしい"]
["小学校",null,524,"形容詞","kind","親切な"]
["小学校",null,525,"形容詞","friendly","友好的な"]
["小学校",null,526,"形容詞","gentle","やさしい"]
["小学校",null,527,"形容詞","active","活動的な"]
["小学校",null,528,"形容詞","brave","勇かんな"]
["小学校",null,529,"形容詞","delicious","とてもおいしい"]
["小学校",null,530,"形容詞","sweet","あまい"]
["小学校",null,531,"形容詞","salty","塩からい"]
["小学校",null,532,"形容詞","sour","すっぱい"]
["小学校",null,533,"形容詞","bitter","苦い"]
["小学校",null,534,"形容詞","yummy","おいしい、すばらしい"]
["小学校",null,535,"形容詞","cloudy","くもりの"]
["小学校",null,536,"形容詞","rainy","雨降りの"]
["小学校",null,537,"形容詞","snowy","雪降りの"]
["小学校",null,538,"形容詞","sunny","晴れた"]
["小学校",null,539,"その他","not","～でない"]
["小学校",null,540,"その他","up","上へ"]
["小学校",null,541,"その他","down","下へ"]
["小学校",null,542,"その他","right","右へ、右"]
["小学校",null,543,"その他","left","左へ、左"]
["小学校",null,544,"その他","here","ここで"]
["小学校",null,545,"その他","outside","外で"]
["小学校",null,546,"その他","straight","まっすぐに"]
["小学校",null,547,"その他","very","とても"]
["小学校",null,548,"その他","well","上手に、よく"]
["小学校",null,549,"その他","so","そのように、とても"]
["小学校",null,550,"その他","always","いつも"]
["小学校",null,551,"その他","usually","ふつうは、たいていは"]
["小学校",null,552,"その他","sometimes","ときどき"]
["小学校",null,553,"その他","never","決して～ない"]
["小学校",null,554,"その他","together","一緒に"]
["小学校",null,555,"その他","when","いつ"]
["小学校",null,556,"その他","where","どこに"]
["小学校",null,557,"その他","how","どのようにして"]
["小学校",null,558,"その他","why","なぜ"]
["小学校",null,559,"その他","then","その時、それなら"]
["小学校",null,560,"その他","for","～のために"]
["小学校",null,561,"その他","from","～から"]
["小学校",null,562,"その他","in","～の中に"]
["小学校",null,563,"その他","on","～の上に"]
["小学校",null,564,"その他","under","～の下に"]
["小学校",null,565,"その他","about","～について、およそ、約"]
["小学校",null,566,"その他","by","～によって、～のそばに"]
["小学校",null,567,"その他","I","私"]
["小学校",null,568,"その他","my","私の"]
["小学校",null,569,"その他","me","私を"]
["小学校",null,570,"その他","you","あなた"]
["小学校",null,571,"その他","your","あなたの"]
["小学校",null,572,"その他","you","あなたを"]
["小学校",null,573,"その他","we","私たち"]
["小学校",null,574,"その他","our","私たちの"]
["小学校",null,575,"その他","us","私たちを"]
["小学校",null,576,"その他","he","彼"]
["小学校",null,577,"その他","his","彼の"]
["小学校",null,578,"その他","him","彼を"]
["小学校",null,579,"その他","she","彼女"]
["小学校",null,580,"その他","her","彼女の"]
["小学校",null,581,"その他","her","彼女を"]
["小学校",null,582,"その他","they","彼ら"]
["小学校",null,583,"その他","their","彼らの"]
["小学校",null,584,"その他","them","彼らを"]
["小学校",null,585,"その他","it","それ"]
["小学校",null,586,"その他","this","これ"]
["小学校",null,587,"その他","that","あれ"]
["小学校",null,588,"その他","what","何"]
["小学校",null,589,"その他","who","誰"]
["小学校",null,590,"その他","hi","やあ"]
["小学校",null,591,"その他","hello","こんにちは"]
["小学校",null,592,"その他","yes","そうです"]
["小学校",null,593,"その他","no","いいえ"]
["小学校",null,594,"その他","OK","いいよ"]
["小学校",null,595,"その他","bye","さようなら"]
["小学校",null,596,"その他","goodbye","さようなら"]
["小学校",null,597,"その他","let’s","～しよう"]
["小学校",null,598,"その他","and","～と…"]
["小学校",null,599,"その他","but","しかし"]
["小学校",null,600,"その他","can","～できる"]

{"sheet":"Sheet1","index":6,"n_rows":381,"n_cols":3,"rows_kept":381,"cut":false,"hidden":false,"merged":[]}
[1,"food","食べ物"]
[2,"fruit","果物"]
[3,"apple","りんご"]
[4,"banana","バナナ"]
[5,"peach","もも"]
[6,"strawberry","いちご"]
[7,"grape","ぶどう"]
[8,"orange","オレンジ"]
[9,"melon","メロン"]
[10,"pineapple","パイナップル"]
[11,"cherry","さくらんぼ"]
[12,"lemon","レモン"]
[13,"kiwi fruit","キウイフルーツ"]
[14,"watermelon","すいか"]
[15,"vegetable","野菜"]
[16,"tomato","トマト"]
[17,"carrot","にんじん"]
[18,"onion","たまねぎ"]
[19,"potato","じゃがいも"]
[20,"green pepper","ピーマン"]
[21,"cucumber","きゅうり"]
[22,"lettuce","レタス"]
[23,"cabbage","キャベツ"]
[24,"corn","とうもろこし"]
[25,"mushroom","きのこ"]
[26,"nut","木の実、ナッツ"]
[27,"broccoli","ブロッコリー"]
[28,"radish","はつかだいこん"]
[29,"zucchini","ズッキーニ"]
[30,"breakfast","朝食"]
[31,"lunch”","昼食"]
[32,"dinner","夕食"]
[33,"rice","米、ごはん"]
[34,"rice ball","おにぎり"]
[35,"miso","みそ"]
[36,"miso soup","味噌汁"]
[37,"noodle","めん"]
[38,"bread","パン"]
[39,"jam","ジャム"]
[40,"egg","卵"]
[41,"fish","魚"]
[42,"curry and rice","カレーライス"]
[43,"ramen","ラーメン"]
[44,"sandwich","サンドイッチ"]
[45,"spaghetti","スパゲッティ"]
[46,"pizza","ピザ"]
[47,"hamburger","ハンバーガー"]
[48,"hot dog","ホットドッグ"]
[49,"salad","サラダ"]
[50,"pie","パイ"]
[51,"fried chicken","フライドチキン"]
[52,"french fries","フライドポテト"]
[53,"soup","スープ"]
[54,"corn soup","コーンスープ"]
[55,"sausage","ソーセージ"]
[56,"beefsteak","ビーフステーキ"]
[57,"omelet","オムレツ"]
[58,"grilled fish","焼き魚"]
[59,"namul","ナムル"]
[60,"dessert","デザート"]
[61,"ice cream","アイスクリーム"]
[62,"cake","ケーキ"]
[63,"cup cake","カップケーキ"]
[64,"chocolate","チョコレート"]
[65,"donut","ドーナツ"]
[66,"popcorn","ポップコーン"]
[67,"daifuku","大福"]
[68,"pudding","プリン"]
[69,"parfait","パフェ"]
[70,"shaved ice","かき氷"]
[71,"gum","ガム"]
[72,"snack","軽食、おやつ"]
[1,"water","水"]
[2,"milk","牛乳"]
[3,"juice","〔果汁100％の〕ジュース"]
[4,"coffee","コーヒー"]
[5,"tea","紅茶"]
[6,"green tea","日本茶、緑茶"]
[7,"mineral water","ミネラルウォーター"]
[8,"soda pop","炭酸飲料"]
[1,"country","国"]
[2,"Argentina","アルゼンチン"]
[3,"Bolivia","ボリビア"]
[4,"Brazil","ブラジル"]
[5,"Britain","イギリス"]
[6,"Canada","カナダ"]
[7,"China","中国"]
[8,"Denmark","デンマーク"]
[9,"Egypt","エジプト"]
[10,"1Finland","フィンランド"]
[11,"France","フランス"]
[12,"Germany","ドイツ"]
[13,"Ghana","ガーナ"]
[14,"Hungary","ハンガリー"]
[15,"India","インド"]
[16,"Italy","イタリア"]
[17,"Japan","日本"]
[18,"Kenya","ケニア"]
[19,"Laos","ラオス"]
[20,"Mongolia","モンゴル"]
[21,"Norway","ノルウェー"]
[22,"Oman","オマーン"]
[23,"Peru","ペルー"]
[24,"Qatar","カタール"]
[25,"Russia","ロシア"]
[26,"Singapore","シンガポール"]
[27,"Spain","スペイン"]
[28,"Turkey","トルコ"]
[29,"Thailand","タイ"]
[30,"United States of America／America","アメリカ合衆国"]
[31,"Vietnam","ベトナム"]
[32,"Mexico","メキシコ"]
[33,"Yemen","イエメン"]
[34,"Zambia","ザンビア"]
[35,"world","世界"]
[1,"job","仕事"]
[2,"teacher","教師"]
[3,"doctor","医者"]
[4,"police officer","警察官"]
[5,"fire fighter","消防士"]
[6,"dentist","歯科医師"]
[7,"pilot","パイロット"]
[8,"flight attendant","客室乗務員"]
[9,"bus driver","バスの運転手"]
[10,"baker","パン屋の店主"]
[11,"florist","生花店の店主"]
[12,"cook","料理人、コック"]
[13,"farmer","農場経営者"]
[14,"artist","芸術家"]
[15,"astronaut","宇宙飛行士"]
[16,"vet","獣医師"]
[17,"zookeeper","動物園の飼育員"]
[18,"soccer player","サッカー選手"]
[19,"baseball player","野球選手"]
[20,"figure skater","フィギュアスケート選手"]
[21,"singer","歌手"]
[22,"comedian","コメディアン"]
[23,"hero","英雄"]
[24,"king","王様"]
[25,"queen","女王"]
["1 ","house ","家"]
["2 ","hospital ","病院"]
["3 ","police station ","警察署"]
["4 ","fire station ","消防署"]
["5 ","post office ","郵便局"]
[6,"post","ポスト"]
[7,"station","駅"]
[8,"park","公園"]
[9,"street","通り、道"]
["10 ","library","図書館、図書室"]
[11,"museum","博物館、美術館"]
[12,"zoo","動物園"]
["13 ","aquarium","水族館"]
[14,"amusement park","遊園地"]
[15,"convenience store","コンビニ"]
[16,"supermarket","スーパーマーケット"]
[17,"department store","デパート"]
[18,"restaurant ","レストラン"]
[19,"bookstore ","書店"]
[20,"flower shop","生花店"]
[21,"gas station ","ガソリンスタンド"]
["22 ","shrine","神社"]
[23,"temple","寺"]
[24,"castle","城"]
[1,"sun ","太陽"]
[2,"river","川"]
[3,"sea ","海"]
[4,"beach ","浜辺"]
[5,"lake ","湖"]
[6,"mountain ","山"]
[7,"tree ","木"]
[8,"flower ","花"]
[9,"rainbow ","にじ"]
[1,"birthday","誕生日"]
["2 ","New Year’s Day","元日"]
[3,"New Year’s Eve","大みそか"]
["4 ","festival","祭り"]
[5,"Snow Festival ","雪まつり"]
[6,"Star Festival","七夕"]
[7,"Children’s Day ","子供の日"]
[8,"Doll’s Festival","ひな祭り"]
[9,"bus ","バス"]
[10,"jet","ジェット機"]
[11,"taxi","タクシー"]
[12,"bicycle","自転車"]
[13,"unicycle","一輪車"]
[14,"wheelchair","車椅子"]
[15,"desk","机"]
[16,"table","テーブル"]
[17,"chair","椅子"]
[18,"bed ","ベッド"]
[19,"TV","テレビ"]
[20,"bath","風呂"]
[21,"cap","（ふちのない）帽子"]
[22,"hat","（ふちのある）帽子"]
[23,"gloves","手袋"]
[24,"shirt","シャツ"]
[25,"T-shirt","Ｔシャツ"]
["26 ","sweater","セーター"]
[27,"vest","ベスト"]
[28,"pants","ズボン"]
[29,"shorts","半ズボン"]
[30,"boots","ブーツ"]
[31,"box","箱"]
[32,"book","本"]
[33,"bag","かばん"]
[34,"umbrella","かさ"]
[35,"clock","時計"]
[36,"watch","腕時計"]
[37,"telephone","電話"]
[38,"computer","コンピューター"]
[39,"cup","茶わん、カップ"]
[40,"dish","皿"]
[41,"lunch box","お弁当箱"]
[42,"calendar","カレンダー"]
[43,"fan","うちわ"]
[44,"newspaper ","新聞"]
[45,"garbage","ゴミ"]
[46,"card","カード"]
[47,"fireworks","花火"]
[48,"net","ネット"]
[49,"treasure","宝物"]
[50,"homework","宿題"]
[51,"TV program","テレビ番組"]
[52,"morning","朝、午前"]
[53,"afternoon","午後"]
[54,"night","夜"]
[55,"today/td>","今日"]
[56,"tomorrow","明日"]
[1,"is","～です"]
[2,"am","～です"]
[3,"are","～です"]
[4,"do","～する"]
[5,"does","～する"]
[6,"speak","話す"]
[7,"read","読む"]
[8,"study","勉強する"]
[9,"like","好きだ"]
[10,"want","ほしい"]
[11,"look","見る"]
[12,"walk","歩く・散歩させる"]
[13,"run","走る"]
[14,"eat","食べる"]
[15,"drink","飲む"]
[16,"sing","歌う"]
[17,"jump","ジャンプする"]
[18,"dance","おどる"]
[19,"stop","止まる"]
[20,"buy","買う"]
[21,"see","見える、（人に）会う"]
[22,"cook","料理する"]
[23,"watch","（じっと）見る"]
[24,"teach","教える"]
[25,"meet","会う"]
[26,"play","（スポーツを）する、演奏する"]
[27,"get","手に入れる"]
[28,"make","作る"]
[29,"put","置く"]
[30,"sound","～に聞こえる"]
[31,"clean","そうじする"]
[32,"wash","洗う"]
[33,"leave","去る、出発する"]
[34,"ride","乗る"]
[35,"turn","曲がる"]
[36,"check","確認する"]
[37,"brush","みがく"]
[38,"practice","練習する"]
[39,"swim","泳ぐ"]
[40,"ski","スキーをする"]
[41,"skate","スケートをする"]
[1,"good","よい、上手な"]
[2,"fine","けっこうな、元気な"]
[3,"nice","すてきな"]
[4,"great","すばらしい"]
[5,"wonderful","すばらしい"]
[6,"fantastic","すばらしい"]
[7,"big","大きい"]
[8,"small","小さい"]
[9,"long","長い"]
[10,"short","短い"]
[11,"high","高い、高く"]
[12,"hard","難しい、一生懸命に"]
[13,"soft","やわらかい"]
[14,"new","新しい"]
[15,"old","古い"]
[16,"many","たくさんの"]
[17,"much","たくさんの"]
[18,"special","特別な"]
[19,"beautiful","美しい"]
[20,"exciting","わくわくさせる"]
[21,"fun","たのしい、おもしろい"]
[22,"hot","暑い、熱い、からい"]
[23,"cold","寒い、冷たい"]
[24,"cool","すずしい"]
[25,"happy","幸せな"]
[26,"sorry","すまないと思って"]
[27,"sad","悲しい"]
[28,"sleepy","ねむい"]
[29,"tired","つかれた"]
[30,"hungry","空腹の"]
[31,"busy","いそがしい"]
[32,"kind","親切な"]
[33,"friendly","友好的な"]
[34,"gentle","やさしい"]
[35,"active","活動的な"]
[36,"brave","勇かんな"]
[37,"delicious","とてもおいしい"]
[38,"sweet","あまい"]
[39,"salty","塩からい"]
[40,"sour","すっぱい"]
[41,"bitter","苦い"]
[42,"yummy","おいしい、すばらしい"]
[43,"cloudy","くもりの"]
[44,"rainy","雨降りの"]
[45,"snowy","雪降りの"]
[46,"sunny","晴れた"]
[1,"not","～でない"]
[2,"up","上へ"]
[3,"down","下へ"]
[4,"right","右へ、右"]
[5,"left","左へ、左"]
[6,"here","ここで"]
[7,"outside","外で"]
[8,"straight","まっすぐに"]
[9,"very","とても"]
[10,"well","上手に、よく"]
[11,"so","そのように、とても"]
[12,"always","いつも"]
[13,"usually","ふつうは、たいていは"]
[14,"sometimes","ときどき"]
[15,"never","決して～ない"]
[16,"together","一緒に"]
[17,"when","いつ"]
[18,"where","どこに"]
[19,"how","どのようにして"]
[20,"why","なぜ"]
[21,"then","その時、それなら"]
[1,"for","～のために"]
[2,"from","～から"]
[3,"in","～の中に"]
[4,"on","～の上に"]
[5,"under","～の下に"]
["6 ","about","～について、およそ、約"]
["7 ","by","～によって、～のそばに"]
[1,"I","私"]
[2,"my","私の"]
[3,"me","私を"]
[4,"you","あなた"]
[5,"your","あなたの"]
[6,"you","あなたを"]
[7,"we","私たち"]
[8,"our","私たちの"]
[9,"us","私たちを"]
[10,"he","彼"]
[11,"his","彼の"]
[12,"him","彼を"]
[13,"she","彼女"]
[14,"her","彼女の"]
[15,"her","彼女を"]
[16,"they","彼ら"]
[17,"their","彼らの"]
[18,"them","彼らを"]
[19,"it","それ"]
[20,"this","これ"]
[21,"that","あれ"]
[22,"what","何"]
[23,"who","誰"]
[1,"hi","やあ"]
[2,"hello","こんにちは"]
[3,"yes","そうです"]
[4,"no","いいえ"]
[5,"oh","おや"]
[6,"wow","ええと"]
[7,"well","ええと"]
["8 ","OK","いいよ"]
[9,"bye","さようなら"]
[10,"goodbye","さようなら"]
[11,"let’s","～しよう"]
[12,"and","～と…"]
[13,"but","しかし"]
[14,"can","～できる"]