{"text_format":"1","workbook":"xlsx","n_sheets":7,"sheets":["和訳","英訳","和訳10問テスト_問題","英訳10問テスト_問題","10問テスト_答え","データ全部","Sheet1"],"not_rendered":{"charts":0,"images":1,"macros":1,"external_links":0,"defined_names":4,"comments":0,"pivot_tables":0},"unopened":[],"bounds":{"document_bytes":16777216,"sheet_cells":100000,"rows_first":2000,"rows_last":500,"rows_between":2000,"halvings":0,"cell_chars":16384,"cell_head_chars":4096},"cells_cut":0,"cells_raw":0,"read":"whole","date_system":"1900"}

{"sheet":"和訳","index":0,"n_rows":6,"n_cols":13,"rows_kept":6,"cut":false,"hidden":false,"merged":[[2,11,2,15],[3,1,3,15],[4,1,4,15],[5,1,5,15]]}
[null,"No.",{"$f":"ROUNDDOWN((H1-F1+1)*RAND(),0)+F1","v":138},null,null,1,"番から",600,"番まで"]
[null,null,null,null,null,null,null,null,null,null,"問題数",10,"題"]
[]
[null,{"$f":"VLOOKUP($C$1,テーブル2[],4,FALSE)","v":"音楽"}]
[]
[null,{"$f":"VLOOKUP($C$1,テーブル2[],3,FALSE)","v":"music"}]

{"sheet":"英訳","index":1,"n_rows":6,"n_cols":13,"rows_kept":6,"cut":false,"hidden":false,"merged":[[2,11,2,15],[3,1,3,15],[5,1,5,15],[4,1,4,15]]}
[null,"No.",{"$f":"ROUNDDOWN((H1-F1+1)*RAND(),0)+F1","v":344},null,null,1,"番から",600,"番まで"]
[null,null,null,null,null,null,null,null,null,null,"問題数",0,"題"]
[]
[null,{"$f":"VLOOKUP($C$1,テーブル2[],3,FALSE)","v":"dentist"}]
[]
[null,{"$f":"VLOOKUP($C$1,テーブル2[],4,FALSE)","v":"歯科医師"}]

{"sheet":"和訳10問テスト_問題","index":2,"n_rows":15,"n_cols":9,"rows_kept":15,"cut":false,"hidden":false,"merged":[[2,3,2,4]]}
[null,"確認 小テスト","小学校",null,null,1,"番から",600,"番まで"]
[null,null,"氏名：　　　　　　　"]
["No","日本語","英語","間違えたら覚えるべくここに練習すべし！"]
[1,{"$f":"英訳10問テスト_問題!B4","v":"P.E."},{"$f":"英訳10問テスト_問題!C4","v":"体育"}]
[2,{"$f":"英訳10問テスト_問題!B5","v":"down"},{"$f":"英訳10問テスト_問題!C5","v":"下へ"}]
[3,{"$f":"英訳10問テスト_問題!B6","v":"beautiful"},{"$f":"英訳10問テスト_問題!C6","v":"美しい"}]
[4,{"$f":"英訳10問テスト_問題!B7","v":"singer"},{"$f":"英訳10問テスト_問題!C7","v":"歌手"}]
[5,{"$f":"英訳10問テスト_問題!B8","v":"cold"},{"$f":"英訳10問テスト_問題!C8","v":"寒い、冷たい"}]
[6,{"$f":"英訳10問テスト_問題!B9","v":"ruler"},{"$f":"英訳10問テスト_問題!C9","v":"定規"}]
[7,{"$f":"英訳10問テスト_問題!B10","v":"Canada"},{"$f":"英訳10問テスト_問題!C10","v":"カナダ"}]
[8,{"$f":"英訳10問テスト_問題!B11","v":"gum"},{"$f":"英訳10問テスト_問題!C11","v":"ガム"}]
[9,{"$f":"英訳10問テスト_問題!B12","v":"cat"},{"$f":"英訳10問テスト_問題!C12","v":"猫"}]
[10,{"$f":"英訳10問テスト_問題!B13","v":"carrot"},{"$f":"英訳10問テスト_問題!C13","v":"にんじん"}]
[]
[null,null,"点"]

{"sheet":"英訳10問テスト_問題","index":3,"n_rows":15,"n_cols":9,"rows_kept":15,"cut":false,"hidden":false,"merged":[[2,3,2,4]]}
[null,"確認 小テスト","小学校",null,null,1,"番から",600,"番まで"]
[null,null,"氏名：　　　　　　　"]
["No","日本語","英語","間違えたら覚えるべくここに練習すべし！"]
[1,{"$f":"VLOOKUP(ROUNDDOWN(($H$1-$F$1+1)*RAND(),0)+$F$1,テーブル2[],3,FALSE)","v":"P.E."},{"$f":"VLOOKUP(B4,データ全部!$E:$F,2,FALSE)","v":"体育"}]
[2,{"$f":"VLOOKUP(ROUNDDOWN(($H$1-$F$1+1)*RAND(),0)+$F$1,テーブル2[],3,FALSE)","v":"down"},{"$f":"VLOOKUP(B5,データ全部!$E:$F,2,FALSE)","v":"下へ"}]
[3,{"$f":"VLOOKUP(ROUNDDOWN(($H$1-$F$1+1)*RAND(),0)+$F$1,テーブル2[],3,FALSE)","v":"beautiful"},{"$f":"VLOOKUP(B6,データ全部!$E:$F,2,FALSE)","v":"美しい"}]
[4,{"$f":"VLOOKUP(ROUNDDOWN(($H$1-$F$1+1)*RAND(),0)+$F$1,テーブル2[],3,FALSE)","v":"singer"},{"$f":"VLOOKUP(B7,データ全部!$E:$F,2,FALSE)","v":"歌手"}]
[5,{"$f":"VLOOKUP(ROUNDDOWN(($H$1-$F$1+1)*RAND(),0)+$F$1,テーブル2[],3,FALSE)","v":"cold"},{"$f":"VLOOKUP(B8,データ全部!$E:$F,2,FALSE)","v":"寒い、冷たい"}]
[6,{"$f":"VLOOKUP(ROUNDDOWN(($H$1-$F$1+1)*RAND(),0)+$F$1,テーブル2[],3,FALSE)","v":"ruler"},{"$f":"VLOOKUP(B9,データ全部!$E:$F,2,FALSE)","v":"定規"}]
[7,{"$f":"VLOOKUP(ROUNDDOWN(($H$1-$F$1+1)*RAND(),0)+$F$1,テーブル2[],3,FALSE)","v":"Canada"},{"$f":"VLOOKUP(B10,データ全部!$E:$F,2,FALSE)","v":"カナダ"}]
[8,{"$f":"VLOOKUP(ROUNDDOWN(($H$1-$F$1+1)*RAND(),0)+$F$1,テーブル2[],3,FALSE)","v":"gum"},{"$f":"VLOOKUP(B11,データ全部!$E:$F,2,FALSE)","v":"ガム"}]
[9,{"$f":"VLOOKUP(ROUNDDOWN(($H$1-$F$1+1)*RAND(),0)+$F$1,テーブル2[],3,FALSE)","v":"cat"},{"$f":"VLOOKUP(B12,データ全部!$E:$F,2,FALSE)","v":"猫"}]
[10,{"$f":"VLOOKUP(ROUNDDOWN(($H$1-$F$1+1)*RAND(),0)+$F$1,テーブル2[],3,FALSE)","v":"carrot"},{"$f":"VLOOKUP(B13,データ全部!$E:$F,2,FALSE)","v":"にんじん"}]
[]
[null,null,"点"]

{"sheet":"10問テスト_答え","index":4,"n_rows":15,"n_cols":9,"rows_kept":15,"cut":false,"hidden":false,"merged":[]}
[null,"確認 小テスト","小学生",null,null,1,"番から",600,"番まで"]
[null,null,"氏名：　　　　　　　"]
["No","日本語","英語"]
[1,{"$f":"英訳10問テスト_問題!B4","v":"P.E."},{"$f":"VLOOKUP(B4,データ全部!$E:$F,2,FALSE)","v":"体育"}]
[2,{"$f":"英訳10問テスト_問題!B5","v":"down"},{"$f":"VLOOKUP(B5,データ全部!$E:$F,2,FALSE)","v":"下へ"}]
[3,{"$f":"英訳10問テスト_問題!B6","v":"beautiful"},{"$f":"VLOOKUP(B6,データ全部!$E:$F,2,FALSE)","v":"美しい"}]
[4,{"$f":"英訳10問テスト_問題!B7","v":"singer"},{"$f":"VLOOKUP(B7,データ全部!$E:$F,2,FALSE)","v":"歌手"}]
[5,{"$f":"英訳10問テスト_問題!B8","v":"cold"},{"$f":"VLOOKUP(B8,データ全部!$E:$F,2,FALSE)","v":"寒い、冷たい"}]
[6,{"$f":"英訳10問テスト_問題!B9","v":"ruler"},{"$f":"VLOOKUP(B9,データ全部!$E:$F,2,FALSE)","v":"定規"}]
[7,{"$f":"英訳10問テスト_問題!B10","v":"Canada"},{"$f":"VLOOKUP(B10,データ全部!$E:$F,2,FALSE)","v":"カナダ"}]
[8,{"$f":"英訳10問テスト_問題!B11","v":"gum"},{"$f":"VLOOKUP(B11,データ全部!$E:$F,2,FALSE)","v":"ガム"}]
[9,{"$f":"英訳10問テスト_問題!B12","v":"cat"},{"$f":"VLOOKUP(B12,データ全部!$E:$F,2,FALSE)","v":"猫"}]
[10,{"$f":"英訳10問テスト_問題!B13","v":"carrot"},{"$f":"VLOOKUP(B13,データ全部!$E:$F,2,FALSE)","v":"にんじん"}]
[]
[null,null,"点"]

{"sheet":"データ全部","index":5,"n_rows":601,"n_cols":6,"rows_kept":601,"cut":false,"hidden":false,"merged":[]}
[null,null,"No","カテゴリー","日本語","英語"]
["小学校",null,1,"名詞","number","数"]
["小学校",null,2,"名詞","zero",0]
["小学校",null,3,"名詞","one",1]
["小学校",null,4,"名詞","two",2]
["小学校",null,5,"名詞","three",3]
["小学校",null,6,"名詞","four",4]
["小学校",null,7,"名詞","five",5]
["小学校",null,8,"名詞","six",6]
["小学校",null,9,"名詞","seven",7]
["小学校",null,10,"名詞","eight",8]
["小学校",null,11,"名詞","nine",9]
["小学校",null,12,"名詞","ten",10]
["小学校",null,13,"名詞","eleven",11]
["小学校",null,14,"名詞","twelve",12]
["小学校",null,15,"名詞","thirteen",13]
["小学校",null,16,"名詞","fourteen",14]
["小学校",null,17,"名詞","fifteen",15]
["小学校",null,18,"名詞","sixteen",16]
["小学校",null,19,"名詞","seventeen",17]
["小学校",null,20,"名詞","eighteen",18]
["小学校",null,21,"名詞","nineteen",19]
["小学校",null,22,"名詞","twenty",20]
["小学校",null,23,"名詞","thirty",30]
["小学校",null,24,"名詞","forty",40]
["小学校",null,25,"名詞","fifty",50]
["小学校",null,26,"名詞","sixty",60]
["小学校",null,27,"名詞","seventy",70]
["小学校",null,28,"名詞","eighty",80]
["小学校",null,29,"名詞","ninety",90]
["小学校",null,30,"名詞","hundred",100]
["小学校",null,31,"名詞","first","1番目の"]
["小学校",null,32,"名詞","second","2番目の"]
["小学校",null,33,"名詞","third","3番目の"]
["小学校",null,34,"名詞","fourth","4番目の"]
["小学校",null,35,"名詞","fifth","5番目の"]
["小学校",null,36,"名詞","sixth","6番目の"]
["小学校",null,37,"名詞","seventh","7番目の"]
["小学校",null,38,"名詞","eighth","8番目の"]
["小学校",null,39,"名詞","ninth","9番目の"]
["小学校",null,40,"名詞","tenth","10番目の"]
["小学校",null,41,"名詞","eleventh","11番目の"]
["小学校",null,42,"名詞","twelfth","12番目の"]
["小学校",null,43,"名詞","thirteenth","13番目の"]
["小学校",null,44,"名詞","fourteenth","14番目の"]
["小学校",null,45,"名詞","fifteenth","15番目の"]
["小学校",null,46,"名詞","sixteenth","16番目の"]
["小学校",null,47,"名詞","seventeenth","17番目の"]
["小学校",null,48,"名詞","eighteenth","18番目の"]
["小学校",null,49,"名詞","nineteenth","19番目の"]
["小学校",null,50,"名詞","twentieth","20番目の"]
["小学校",null,51,"名詞","thirtieth","30番目の"]
["小学校",null,52,"名詞","minute","分"]
["小学校",null,53,"名詞","time","時間"]
["小学校",null,54,"名詞","day","日"]
["小学校",null,55,"名詞","week","週"]
["小学校",null,56,"名詞","month","月"]
["小学校",null,57,"名詞","year","年"]
["小学校",null,58,"名詞","Monday","月曜日"]
["小学校",null,59,"名詞","Tuesday","火曜日"]
["小学校",null,60,"名詞","Wednesday","水曜日"]
["小学校",null,61,"名詞","Thursday","木曜日"]
["小学校",null,62,"名詞","Friday","金曜日"]
["小学校",null,63,"名詞","Saturday","土曜日"]
["小学校",null,64,"名詞","Sunday","日曜日"]
["小学校",null,65,"名詞","January","1月"]
["小学校",null,66,"名詞","February","2月"]
["小学校",null,67,"名詞","March","3月"]
["小学校",null,68,"名詞","April","4月"]
["小学校",null,69,"名詞","May","5月"]
["小学校",null,70,"名詞","June","6月"]
["小学校",null,71,"名詞","July","7月"]
["小学校",null,72,"名詞","August","8月"]
["小学校",null,73,"名詞","September","9月"]
["小学校",null,74,"名詞","October","10月"]
["小学校",null,75,"名詞","November","11月"]
["小学校",null,76,"名詞","December","12月"]
["小学校",null,77,"名詞","spring","春"]
["小学校",null,78,"名詞","summer","夏"]
["小学校",null,79,"名詞","autumn/fall","秋"]
["小学校",null,80,"名詞","winter","冬"]
["小学校",null,81,"名詞","east","東"]
["小学校",null,82,"名詞","west","西"]
["小学校",null,83,"名詞","south","南"]
["小学校",null,84,"名詞","north","北"]
["小学校",null,85,"名詞","color","色"]
["小学校",null,86,"名詞","white","白、白い"]
["小学校",null,87,"名詞","black","黒、黒い"]
["小学校",null,88,"名詞","red","赤、赤い"]
["小学校",null,89,"名詞","blue","青、青い"]
["小学校",null,90,"名詞","yellow","黄色、黄色の"]
["小学校",null,91,"名詞","green","緑色、緑色の"]
["小学校",null,92,"名詞","orange","オレンジ色の"]
["小学校",null,93,"名詞","pink","ピンク色、ピンク色の"]
["小学校",null,94,"名詞","brown","茶色、茶色の"]
["小学校",null,95,"名詞","purple","紫色、紫色の"]
["小学校",null,96,"名詞","shape","形"]
["小学校",null,97,"名詞","circle","円"]
["小学校",null,98,"名詞","triangle","三角形"]
["小学校",null,99,"名詞","square","正方形"]
["小学校",null,100,"名詞","diamond","ひし形"]
["小学校",null,101,"名詞","heart","ハート形"]
["小学校",null,102,"名詞","star","星形、星"]
["小学校",null,103,"名詞","cross","十字形"]
["小学校",null,104,"名詞","man","人、男の人"]
["小学校",null,105,"名詞","woman","女の人"]
["小学校",null,106,"名詞","boy","男の子"]
["小学校",null,107,"名詞","girl","女の子"]
["小学校",null,108,"名詞","father","父"]
["小学校",null,109,"名詞","mother","母"]
["小学校",null,110,"名詞","brother","兄、弟"]
["小学校",null,111,"名詞","sister","姉、妹"]
["小学校",null,112,"名詞","grandfather","祖父"]
["小学校",null,113,"名詞","grandmother","祖母"]
["小学校",null,114,"名詞","friend","友達"]
["小学校",null,115,"名詞","eye","目"]
["小学校",null,116,"名詞","ear","耳"]
["小学校",null,117,"名詞","nose","鼻"]
["小学校",null,118,"名詞","mouth","口"]
["小学校",null,119,"名詞","teeth","歯（※ tooth の複数形）"]
["小学校",null,120,"名詞","face","顔"]
["小学校",null,121,"名詞","head","頭"]
["小学校",null,122,"名詞","hand","手（手首から先）"]
["小学校",null,123,"名詞","shoulder","肩"]
["小学校",null,124,"名詞","knee","ひざ"]
["小学校",null,125,"名詞","leg","あし（足首から上）"]
["小学校",null,126,"名詞","toe","つま先"]
["小学校",null,127,"名詞","school","学校"]
["小学校",null,128,"名詞","elementary school","小学校"]
["小学校",null,129,"名詞","junior high school","中学校"]
["小学校",null,130,"名詞","(senior) high shool","高等学校"]
["小学校",null,131,"名詞","class","授業、組"]
["小学校",null,132,"名詞","arts and crafts","図画工作"]
["小学校",null,133,"名詞","calligraphy","習字"]
["小学校",null,134,"名詞","English","英語"]
["小学校",null,135,"名詞","home economics","家庭科"]
["小学校",null,136,"名詞","Japanese","国語、日本語"]
["小学校",null,137,"名詞","math","算数"]
["小学校",null,138,"名詞","music","音楽"]
["小学校",null,139,"名詞","moral education","道徳"]
["小学校",null,140,"名詞","P.E.","体育"]
["小学校",null,141,"名詞","science","理科、化学"]
["小学校",null,142,"名詞","social studies /td>","社会科"]
["小学校",null,143,"名詞","homeroom activities","学級活動"]
["小学校",null,144,"名詞","classroom","教室"]
["小学校",null,145,"名詞","computer room","コンピュータールーム"]
["小学校",null,146,"名詞","cooking room","家庭科室"]
["小学校",null,147,"名詞","entrance","昇降口、入り口"]
["小学校",null,148,"名詞","gym","体育館"]
["小学校",null,149,"名詞","library","図書室、図書館"]
["小学校",null,150,"名詞","playground","校庭"]
["小学校",null,151,"名詞","restroom","トイレ"]
["小学校",null,152,"名詞","school principal’s office","校長室"]
["小学校",null,153,"名詞","school nurse’s office","保健室"]
["小学校",null,154,"名詞","crayon","クレヨン"]
["小学校",null,155,"名詞","eraser","消しゴム"]
["小学校",null,156,"名詞","glue stick","スティックのり"]
["小学校",null,157,"名詞","ink","インク"]
["小学校",null,158,"名詞","magnet","じしゃく"]
["小学校",null,159,"名詞","marker","マーカー"]
["小学校",null,160,"名詞","notebook","ノート"]
["小学校",null,161,"名詞","pen","ペン"]
["小学校",null,162,"名詞","pencil","鉛筆"]
["小学校",null,163,"名詞","pencil case","筆箱"]
["小学校",null,164,"名詞","pencil sharpener","鉛筆削り"]
["小学校",null,165,"名詞","ruler","定規"]
["小学校",null,166,"名詞","scissors","はさみ"]
["小学校",null,167,"名詞","stapler","ホッチキス"]
["小学校",null,168,"名詞","entrance ceremony","入学式"]
["小学校",null,169,"名詞","field trip","遠足"]
["小学校",null,170,"名詞","graduation ceremony","卒業式"]
["小学校",null,171,"名詞","school trip","修学旅行"]
["小学校",null,172,"名詞","sports festival","運動会"]
["小学校",null,173,"名詞","swimming meet","水泳大会"]
["小学校",null,174,"名詞","sport","スポーツ"]
["小学校",null,175,"名詞","soccer","サッカー"]
["小学校",null,176,"名詞","baseball","野球"]
["小学校",null,177,"名詞","basketball","バスケットボール"]
["小学校",null,178,"名詞","volleyball","バレーボール"]
["小学校",null,179,"名詞","dodgeball","ドッジボール"]
["小学校",null,180,"名詞","wimming","水泳"]
["小学校",null,181,"名詞","table tennis","卓球"]
["小学校",null,182,"名詞","badminton","バドミントン"]
["小学校",null,183,"名詞","tennis","テニス"]
["小学校",null,184,"名詞","marathon","マラソン"]
["小学校",null,185,"名詞","gymnastics","体操"]
["小学校",null,186,"名詞","track and field","陸上競技"]
["小学校",null,187,"名詞","cycling","サイクリング"]
["小学校",null,188,"名詞","rugby","ラグビー"]
["小学校",null,189,"名詞","boxing","ボクシング"]
["小学校",null,190,"名詞","climbing","登山"]
["小学校",null,191,"名詞","bat","バット"]
["小学校",null,192,"名詞","ball","ボール"]
["小学校",null,193,"名詞","racket","ラケット"]
["小学校",null,194,"名詞","athletics","運動競技"]
["小学校",null,195,"名詞","camping","キャンプ"]
["小学校",null,196,"名詞","fishing","魚釣り"]
["小学校",null,197,"名詞","hiking","ハイキング"]
["小学校",null,198,"名詞","jogging","ジョギング"]
["小学校",null,199,"名詞","jump rope","なわとび"]
{"$rows_left_out":402}
{"sheet":"Sheet1","index":6,"n_rows":381,"n_cols":3,"rows_kept":381,"cut":false,"hidden":false,"merged":[]}
[1,"food","食べ物"]
[2,"fruit","果物"]
[3,"apple","りんご"]
[4,"banana","バナナ"]
[5,"peach","もも"]
[6,"strawberry","いちご"]
[7,"grape","ぶどう"]
[8,"orange","オレンジ"]
[9,"melon","メロン"]
[10,"pineapple","パイナップル"]
[11,"cherry","さくらんぼ"]
[12,"lemon","レモン"]
[13,"kiwi fruit","キウイフルーツ"]
[14,"watermelon","すいか"]
[15,"vegetable","野菜"]
[16,"tomato","トマト"]
[17,"carrot","にんじん"]
[18,"onion","たまねぎ"]
[19,"potato","じゃがいも"]
[20,"green pepper","ピーマン"]
[21,"cucumber","きゅうり"]
[22,"lettuce","レタス"]
[23,"cabbage","キャベツ"]
[24,"corn","とうもろこし"]
[25,"mushroom","きのこ"]
[26,"nut","木の実、ナッツ"]
[27,"broccoli","ブロッコリー"]
[28,"radish","はつかだいこん"]
[29,"zucchini","ズッキーニ"]
[30,"breakfast","朝食"]
[31,"lunch”","昼食"]
[32,"dinner","夕食"]
[33,"rice","米、ごはん"]
[34,"rice ball","おにぎり"]
[35,"miso","みそ"]
[36,"miso soup","味噌汁"]
[37,"noodle","めん"]
[38,"bread","パン"]
[39,"jam","ジャム"]
[40,"egg","卵"]
[41,"fish","魚"]
[42,"curry and rice","カレーライス"]
[43,"ramen","ラーメン"]
[44,"sandwich","サンドイッチ"]
[45,"spaghetti","スパゲッティ"]
[46,"pizza","ピザ"]
[47,"hamburger","ハンバーガー"]
[48,"hot dog","ホットドッグ"]
[49,"salad","サラダ"]
[50,"pie","パイ"]
[51,"fried chicken","フライドチキン"]
[52,"french fries","フライドポテト"]
[53,"soup","スープ"]
[54,"corn soup","コーンスープ"]
[55,"sausage","ソーセージ"]
[56,"beefsteak","ビーフステーキ"]
[57,"omelet","オムレツ"]
[58,"grilled fish","焼き魚"]
[59,"namul","ナムル"]
[60,"dessert","デザート"]
[61,"ice cream","アイスクリーム"]
[62,"cake","ケーキ"]
[63,"cup cake","カップケーキ"]
[64,"chocolate","チョコレート"]
[65,"donut","ドーナツ"]
[66,"popcorn","ポップコーン"]
[67,"daifuku","大福"]
[68,"pudding","プリン"]
[69,"parfait","パフェ"]
[70,"shaved ice","かき氷"]
[71,"gum","ガム"]
[72,"snack","軽食、おやつ"]
[1,"water","水"]
[2,"milk","牛乳"]
[3,"juice","〔果汁100％の〕ジュース"]
[4,"coffee","コーヒー"]
[5,"tea","紅茶"]
[6,"green tea","日本茶、緑茶"]
[7,"mineral water","ミネラルウォーター"]
[8,"soda pop","炭酸飲料"]
[1,"country","国"]
[2,"Argentina","アルゼンチン"]
[3,"Bolivia","ボリビア"]
[4,"Brazil","ブラジル"]
[5,"Britain","イギリス"]
[6,"Canada","カナダ"]
[7,"China","中国"]
[8,"Denmark","デンマーク"]
[9,"Egypt","エジプト"]
[10,"1Finland","フィンランド"]
[11,"France","フランス"]
[12,"Germany","ドイツ"]
[13,"Ghana","ガーナ"]
[14,"Hungary","ハンガリー"]
[15,"India","インド"]
[16,"Italy","イタリア"]
[17,"Japan","日本"]
[18,"Kenya","ケニア"]
[19,"Laos","ラオス"]
[20,"Mongolia","モンゴル"]
[21,"Norway","ノルウェー"]
[22,"Oman","オマーン"]
[23,"Peru","ペルー"]
[24,"Qatar","カタール"]
[25,"Russia","ロシア"]
[26,"Singapore","シンガポール"]
[27,"Spain","スペイン"]
[28,"Turkey","トルコ"]
[29,"Thailand","タイ"]
[30,"United States of America／America","アメリカ合衆国"]
[31,"Vietnam","ベトナム"]
[32,"Mexico","メキシコ"]
[33,"Yemen","イエメン"]
[34,"Zambia","ザンビア"]
[35,"world","世界"]
[1,"job","仕事"]
[2,"teacher","教師"]
[3,"doctor","医者"]
[4,"police officer","警察官"]
[5,"fire fighter","消防士"]
[6,"dentist","歯科医師"]
[7,"pilot","パイロット"]
[8,"flight attendant","客室乗務員"]
[9,"bus driver","バスの運転手"]
[10,"baker","パン屋の店主"]
[11,"florist","生花店の店主"]
[12,"cook","料理人、コック"]
[13,"farmer","農場経営者"]
[14,"artist","芸術家"]
[15,"astronaut","宇宙飛行士"]
[16,"vet","獣医師"]
[17,"zookeeper","動物園の飼育員"]
[18,"soccer player","サッカー選手"]
[19,"baseball player","野球選手"]
[20,"figure skater","フィギュアスケート選手"]
[21,"singer","歌手"]
[22,"comedian","コメディアン"]
[23,"hero","英雄"]
[24,"king","王様"]
[25,"queen","女王"]
["1 ","house ","家"]
["2 ","hospital ","病院"]
["3 ","police station ","警察署"]
["4 ","fire station ","消防署"]
["5 ","post office ","郵便局"]
[6,"post","ポスト"]
[7,"station","駅"]
[8,"park","公園"]
[9,"street","通り、道"]
["10 ","library","図書館、図書室"]
[11,"museum","博物館、美術館"]
[12,"zoo","動物園"]
["13 ","aquarium","水族館"]
[14,"amusement park","遊園地"]
[15,"convenience store","コンビニ"]
[16,"supermarket","スーパーマーケット"]
[17,"department store","デパート"]
[18,"restaurant ","レストラン"]
[19,"bookstore ","書店"]
[20,"flower shop","生花店"]
[21,"gas station ","ガソリンスタンド"]
["22 ","shrine","神社"]
[23,"temple","寺"]
[24,"castle","城"]
[1,"sun ","太陽"]
[2,"river","川"]
[3,"sea ","海"]
[4,"beach ","浜辺"]
[5,"lake ","湖"]
[6,"mountain ","山"]
[7,"tree ","木"]
[8,"flower ","花"]
[9,"rainbow ","にじ"]
[1,"birthday","誕生日"]
["2 ","New Year’s Day","元日"]
[3,"New Year’s Eve","大みそか"]
["4 ","festival","祭り"]
[5,"Snow Festival ","雪まつり"]
[6,"Star Festival","七夕"]
[7,"Children’s Day ","子供の日"]
[8,"Doll’s Festival","ひな祭り"]
[9,"bus ","バス"]
[10,"jet","ジェット機"]
[11,"taxi","タクシー"]
[12,"bicycle","自転車"]
[13,"unicycle","一輪車"]
[14,"wheelchair","車椅子"]
[15,"desk","机"]
[16,"table","テーブル"]
[17,"chair","椅子"]
[18,"bed ","ベッド"]
[19,"TV","テレビ"]
[20,"bath","風呂"]
[21,"cap","（ふちのない）帽子"]
[22,"hat","（ふちのある）帽子"]
[23,"gloves","手袋"]
[24,"shirt","シャツ"]
[25,"T-shirt","Ｔシャツ"]
["26 ","sweater","セーター"]
[27,"vest","ベスト"]
{"$rows_left_out":181}